Target
Apoptotic protease-activating factor 1
Ligand
BDBM61197
Substrate
Meas. Tech.
Dose response confirmation of uHTS hits for Apaf-1 in a Fluorescent assay
IC50
2630±n/a nM
Citation
 PubChem, PC Dose response confirmation of uHTS hits for Apaf-1 in a Fluorescent assay PubChem Bioassay (2011)[AID] 
Target
Name:
Apoptotic protease-activating factor 1
Synonyms:
APAF1 Apoptotic peptidase activating factor 1 | KIAA0413
Type:
Enzyme Catalytic Domain
Mol. Mass.:
141834.40
Organism:
Homo sapiens (Human)
Description:
O14727
Residue:
1248
  
Inhibitor
Name:
BDBM61197
Synonyms:
(2,6-dipyrrolidinopyrimidin-4-yl)-(p-anisylideneamino)amine MLS000720213 N-[(4-methoxyphenyl)methylideneamino]-2,6-dipyrrolidin-1-yl-pyrimidin-4-amine SMR000304742 | cid_2851352
Type:
Small organic molecule
Emp. Form.:
C20H26N6O
Mol. Mass.:
366.46
SMILES:
COc1ccc(CN=Nc2cc(nc(n2)N2CCCC2)N2CCCC2)cc1
: