Target
Apoptotic protease-activating factor 1
Ligand
BDBM48003
Substrate
Meas. Tech.
Dose response confirmation of uHTS hits for Apaf-1 in a Fluorescent assay
IC50
1010±n/a nM
Citation
 PubChem, PC Dose response confirmation of uHTS hits for Apaf-1 in a Fluorescent assay PubChem Bioassay (2011)[AID] 
Target
Name:
Apoptotic protease-activating factor 1
Synonyms:
APAF1 Apoptotic peptidase activating factor 1 | KIAA0413
Type:
Enzyme Catalytic Domain
Mol. Mass.:
141834.40
Organism:
Homo sapiens (Human)
Description:
O14727
Residue:
1248
  
Inhibitor
Name:
BDBM48003
Synonyms:
2-Methyl-8-morpholin-4-yl-5,6-dioxo-5,6-dihydro-quinoline-4-carboxylic acid methyl ester 5,6-diketo-2-methyl-8-morpholino-cinchoninic acid methyl ester SMR000513626 methyl 2-methyl-8-morpholin-4-yl-5,6-bis(oxidanylidene)quinoline-4-carboxylate | methyl 2-methyl-8-morpholin-4-yl-5,6-dioxoquinoline-4-carboxylate
Type:
Small organic molecule
Emp. Form.:
C16H16N2O5
Mol. Mass.:
316.3086
SMILES:
COC(=O)c1cc(C)nc2C(=CC(=O)C(=O)c12)N1CCOCC1
: