Target
Apoptotic protease-activating factor 1
Ligand
BDBM34648
Substrate
Meas. Tech.
Dose Response validation of Inhibitors of Apaf-1 using a Fluorescent Interference Counterscreen assay
IC50
>100000±0 nM
Citation
 PubChem, PC Dose Response validation of Inhibitors of Apaf-1 using a Fluorescent Interference Counterscreen assay PubChem Bioassay (2011)[AID] 
Target
Name:
Apoptotic protease-activating factor 1
Synonyms:
APAF1 Apoptotic peptidase activating factor 1 | KIAA0413
Type:
Enzyme Catalytic Domain
Mol. Mass.:
141834.40
Organism:
Homo sapiens (Human)
Description:
O14727
Residue:
1248
  
Inhibitor
Name:
BDBM34648
Synonyms:
(4-chlorodithiazol-5-ylidene)-(4,6-dimethyl-2-pyridyl)amine 4-chloro-N-(4,6-dimethyl-2-pyridinyl)-5-dithiazolimine MLS000104333 cid_757789
Type:
Small organic molecule
Emp. Form.:
C9H8ClN3S2
Mol. Mass.:
257.763
SMILES:
Cc1cc(C)nc(c1)N=c1ssnc1Cl
: