Target
Alpha-mannosidase 2
Ligand
BDBM84473
Substrate
pH
5.6±0
Temperature
310.15±0 K
Ki
4.8e+2±n/a nM
Citation
 Li, BKawatkar, SPGeorge, SStrachan, HWoods, RJSiriwardena, AMoremen, KWBoons, GJ Inhibition of Golgi mannosidase II with mannostatin A analogues: synthesis, biological evaluation, and structure-activity relationship studies. Chembiochem 5:1220-7 (2004)  
Target
Name:
Alpha-mannosidase 2
Synonyms:
Alpha-mannosidase 2A1 Lysosomal acid alpha-mannosidase MAN2A1 Mannosidase alpha class 2A member 1 Mannosyl-oligosaccharide 1,3-1,6-alpha-mannosidase
Type:
Protein
Mol. Mass.:
131156.65
Organism:
Homo sapiens (Human)
Description:
Q16706
Residue:
1144
  
Inhibitor
Name:
BDBM84473
Synonyms:
Aminocyclopentitetrol, 2f
Type:
Small organic molecule
Emp. Form.:
C13H19NO5
Mol. Mass.:
269.2937
SMILES:
COc1ccc(CN[C@H]2[C@@H](O)[C@@H](O)[C@@H](O)[C@H]2O)cc1
: