Target
cAMP-dependent protein kinase catalytic subunit alpha
Ligand
BDBM3149
Substrate
Histone type HL
Meas. Tech.
PKC assay
IC50
60±n/a nM
Citation
 Mendoza, JSJagdmann , GEGosnell, PA SYNTHESIS AND BIOLOGICAL EVALUATION OF CONFORMATIONALLY CONSTRAINED BICYCLIC AND TRICYCLIC BALANOL ANALOGUES AS INHIBITORS OF PROTEIN KINASE C. Bioorg Med Chem Lett 5:2211-6 (1995)    Article 
Target
Name:
cAMP-dependent protein kinase catalytic subunit alpha
Synonyms:
KAPCA_BOVIN PKC Protein Kinase C cAMP-Dependent Protein Kinase (PKA) cAMP-dependent protein kinase A cAMP-dependent protein kinase, alpha-catalytic subunit
Type:
Enzyme Complex
Mol. Mass.:
40627.77
Organism:
Bos taurus (bovine)
Description:
The PKA holoenzyme purified from bovine heart, exists as an inactive tetrameric complex, which consists of a regulatory dimer associated with two catalytic subunits. It requires cAMP to activate the enzymatic reaction.
Residue:
351
  
Inhibitor
Name:
BDBM3149
Synonyms:
2-{[2,6-dihydroxy-4-({[(3R,4R)-3-[(4-hydroxybenzene)amido]azepan-4-yl]oxy}carbonyl)phenyl]carbonyl}-3-hydroxybenzoic acid Balanol analog 1 CHEMBL60254
Type:
Small organic molecule
Emp. Form.:
C28H26N2O10
Mol. Mass.:
550.5134
SMILES:
OC(=O)c1cccc(O)c1C(=O)c1c(O)cc(cc1O)C(=O)O[C@@H]1CCCNC[C@H]1NC(=O)c1ccc(O)cc1
:
Substrate
Name:
Histone type HL
Synonyms:
Type:
Peptide
Mol. Mass.:
358.43
Organism:
Description:
unfractionated histone (Worthington) 30 uM [gamma-32P]ATP as co-substrate.
Residue:
3
NA