Target
Somatostatin receptor type 2
Ligand
BDBM84623
Substrate
Ki
4.4±n/a nM
Comments
PDSP_1294
Citation
 Patel, YCSrikant, CB Subtype selectivity of peptide analogs for all five cloned human somatostatin receptors (hsstr 1-5). Endocrinology 135:2814-7 (1994)  
Target
Name:
Somatostatin receptor type 2
Synonyms:
SOMATOSTATIN SST2 SS-2-R SS2R SSTR2 | Somatostatin receptor type 2 (SSTR2)
Type:
Enzyme
Mol. Mass.:
41344.94
Organism:
Homo sapiens (Human)
Description:
P30874
Residue:
369
  
Inhibitor
Name:
BDBM84623
Synonyms:
NC4-28B
Type:
Small organic molecule
Emp. Form.:
C55H64N10O9S2
Mol. Mass.:
1073.288
SMILES:
NCCCCC1NC(=O)C(Cc2c[nH]c3ccccc23)NC(=O)C(Cc2ccc(O)cc2)NC(=O)C(CSSCC(NC(=O)C(CO)NC1=O)C(=O)NCc1cccc2ccccc12)NC(=O)C(N)Cc1ccccc1
: