Target
Somatostatin receptor type 5
Ligand
BDBM50063819
Substrate
Ki
1.4±n/a nM
Comments
PDSP_380
Citation
 Patel, YCSrikant, CB Subtype selectivity of peptide analogs for all five cloned human somatostatin receptors (hsstr 1-5). Endocrinology 135:2814-7 (1994)  
Target
Name:
Somatostatin receptor type 5
Synonyms:
SOMATOSTATIN SST5 SS5-R SSR5_HUMAN Somatostatin receptor type 5 (SSTR5)
Type:
Enzyme
Mol. Mass.:
39218.02
Organism:
Homo sapiens (Human)
Description:
P35346
Residue:
364
  
Inhibitor
Name:
BDBM50063819
Synonyms:
BIM 23050 cyclo[NMeDAla-Tyr-DTrp-Lys-Val-Phe]
Type:
Small organic molecule
Emp. Form.:
C44H56N8O7
Mol. Mass.:
808.9648
SMILES:
CC(C)[C@@H]1NC(=O)[C@@H](CCCCN)NC(=O)[C@@H](Cc2c[nH]c3ccccc23)NC(=O)[C@@H](Cc2ccc(O)cc2)NC(=O)[C@@H](C)N(C)C(=O)[C@@H](Cc2ccccc2)NC1=O
: