Target
Protein kinase C beta type
Ligand
BDBM3176
Substrate
Lysine-rich histone
Meas. Tech.
PKC assay
IC50
28±n/a nM
Citation
 Davis, PDElliott, LHHarris, WHill, CHHurst, SAKeech, EKumar, MKLawton, GNixon, JSWilkinson, SE Inhibitors of protein kinase C. 2. Substituted bisindolylmaleimides with improved potency and selectivity. J Med Chem 35:994-1001 (1992)  
Target
Name:
Protein kinase C beta type
Synonyms:
KPCB_RAT Pkcb Prkcb1 Protein kinase C (PKC) | Protein kinase C beta
Type:
Enzyme Mixture
Mol. Mass.:
76755.54
Organism:
Rattus norvegicus (rat)
Description:
PKC from rat brain is known to contain predominately the conventional PKC isoforms, alpha, beta I, beta II, gamma.
Residue:
671
  
Inhibitor
Name:
BDBM3176
Synonyms:
Bisindolylmaleimide 11c | [(4-{3-[4-(1-methyl-1H-indol-3-yl)-2,5-dioxo-2,5-dihydro-1H-pyrrol-3-yl]-1H-indol-1-yl}butyl)sulfanyl]methanimidamide
Type:
Small organic molecule
Emp. Form.:
C26H25N5O2S
Mol. Mass.:
471.574
SMILES:
Cn1cc(C2=C(C(=O)NC2=O)c2cn(CCCCSC(N)=N)c3ccccc23)c2ccccc12
:
Substrate
Name:
Lysine-rich histone
Synonyms:
ING Peptide histone type IIIS
Type:
Peptide
Mol. Mass.:
10508.21
Organism:
Bos taurus (bovine)
Description:
Purified as a lysine rich fraction of histone H1 from calf thymus.
Residue:
105