Target
cAMP-dependent protein kinase catalytic subunit alpha
Ligand
BDBM2681
Substrate
histone (type Vs)
Meas. Tech.
PKA assay
IC50
25600±n/a nM
Citation
 Davis, PDElliott, LHHarris, WHill, CHHurst, SAKeech, EKumar, MKLawton, GNixon, JSWilkinson, SE Inhibitors of protein kinase C. 2. Substituted bisindolylmaleimides with improved potency and selectivity. J Med Chem 35:994-1001 (1992)  
Target
Name:
cAMP-dependent protein kinase catalytic subunit alpha
Synonyms:
KAPCA_BOVIN PKC Protein Kinase C cAMP-Dependent Protein Kinase (PKA) cAMP-dependent protein kinase A cAMP-dependent protein kinase, alpha-catalytic subunit
Type:
Enzyme Complex
Mol. Mass.:
40627.77
Organism:
Bos taurus (bovine)
Description:
The PKA holoenzyme purified from bovine heart, exists as an inactive tetrameric complex, which consists of a regulatory dimer associated with two catalytic subunits. It requires cAMP to activate the enzymatic reaction.
Residue:
351
  
Inhibitor
Name:
BDBM2681
Synonyms:
3-{1-[3-(dimethylamino)propyl]-1H-indol-3-yl}-4-(1-methyl-1H-indol-3-yl)-2,5-dihydro-1H-pyrrole-2,5-dione CHEMBL268769
Type:
Small organic molecule
Emp. Form.:
C26H26N4O2
Mol. Mass.:
426.5102
SMILES:
CN(C)CCCn1cc(C2=C(C(=O)NC2=O)c2cn(C)c3ccccc23)c2ccccc12
:
Substrate
Name:
histone (type Vs)
Synonyms:
Type:
Other Protein Type
Mol. Mass.:
358.43
Organism:
Description:
11 uM [gamma-32P]ATP as co-substrate.
Residue:
3
NA