Target
Voltage-dependent L-type calcium channel subunit alpha-1S
Ligand
BDBM50000365
Substrate
Meas. Tech.
ChEBML_53192
Kd
250±n/a nM
Citation
 Kimball, SDFloyd, DMDas, JHunt, JTKrapcho, JRovnyak, GDuff, KJLee, VGMoquin, RVTurk, CF Benzazepinone calcium channel blockers. 4. Structure-activity overview and intracellular binding site. J Med Chem 35:780-93 (1992)  
Target
Name:
Voltage-dependent L-type calcium channel subunit alpha-1S
Synonyms:
CAC1S_HUMAN CACN1 CACNL1A3 Voltage-dependent L-type calcium channel subunit alpha-1S Voltage-gated L-type calcium channel alpha-1S subunit Voltage-gated calcium channel subunit alpha Cav1.1
Type:
PROTEIN
Mol. Mass.:
212348.33
Organism:
Homo sapiens (Human)
Description:
ChEMBL_42767
Residue:
1873
  
Inhibitor
Name:
BDBM50000365
Synonyms:
1-(2-Dimethylamino-ethyl)-4-(4-methoxy-phenyl)-3-propyl-1,3,4,5-tetrahydro-benzo[b]azepin-2-one | CHEMBL350321
Type:
Small organic molecule
Emp. Form.:
C24H32N2O2
Mol. Mass.:
380.5231
SMILES:
CCC[C@@H]1[C@@H](Cc2ccccc2N(CCN(C)C)C1=O)c1ccc(OC)cc1
: