Target
Platelet-activating factor receptor
Ligand
BDBM50000701
Substrate
Meas. Tech.
ChEBML_155155
Ki
157±n/a nM
Citation
 Guinn, DESummers, JBHeyman, HRConway, RGRhein, DAAlbert, DHMagoc, TCarter, GW Synthesis and structure-activity relationships of a series of novel benzopyran-containing platelet activating factor antagonists. J Med Chem 35:2055-61 (1992)  
Target
Name:
Platelet-activating factor receptor
Synonyms:
PAF-R PTAFR_CAVPO Platelet-activating factor receptor
Type:
Protein
Mol. Mass.:
39005.63
Organism:
Cavia porcellus
Description:
Residue:
342
  
Inhibitor
Name:
BDBM50000701
Synonyms:
2-{7-[4-(4-Fluoro-phenyl)-1-methyl-butyl]-10,10-dimethyl-3-methylcarbamoylmethyl-2,3,4,10-tetrahydro-1H-9-oxa-3-aza-phenanthren-5-yloxy}-N,N-dimethyl-acetamide | CHEMBL264497
Type:
Small organic molecule
Emp. Form.:
C32H42FN3O4
Mol. Mass.:
551.692
SMILES:
CNC(=O)CN1CCC2=C(C1)c1c(OCC(=O)N(C)C)cc(cc1OC2(C)C)C(C)CCCc1ccc(F)cc1
: