Target
5-hydroxytryptamine receptor 1A
Ligand
BDBM50001116
Substrate
Meas. Tech.
ChEBML_1551
Ki
0.600000±n/a nM
Citation
 Ennis, MDBaze, MESmith, MWLawson, CFMcCall, RBLahti, RAPiercey, MF Novel indolodioxanes with antihypertensive effects: potent ligands for the 5-HT1A receptor. J Med Chem 35:3058-66 (1992)  
Target
Name:
5-hydroxytryptamine receptor 1A
Synonyms:
5-HT-1A 5-hydroxytryptamine receptor 1A (5-HT-1A) ADRB2RL1 Dopamine D2 receptor and serotonin 1a receptor HTR1A | Serotonin receptor 1A
Type:
Mol. Mass.:
46122.49
Organism:
Homo sapiens (Human)
Description:
Residue:
422
  
Inhibitor
Name:
BDBM50001116
Synonyms:
8-[4-(2-Oxo-2,3-dihydro-benzoimidazol-1-yl)-piperidin-1-ylmethyl]-7,8-dihydro-3H-6,9-dioxa-3-aza-cyclopenta[a]naphthalene-2-carboxylic acid methyl ester | CHEMBL418802
Type:
Small organic molecule
Emp. Form.:
C25H26N4O5
Mol. Mass.:
462.4977
SMILES:
COC(=O)c1cc2c3OC(CN4CCC(CC4)n4c5ccccc5[nH]c4=O)COc3ccc2[nH]1
: