Target
Oxytocin receptor
Ligand
BDBM50001337
Substrate
Meas. Tech.
ChEMBL_149060 (CHEMBL760424)
IC50
4500±n/a nM
Citation
 Evans, BELeighton, JLRittle, KEGilbert, KFLundell, GFGould, NPHobbs, DWDiPardo, RMVeber, DFPettibone, DJ Orally active, nonpeptide oxytocin antagonists. J Med Chem 35:3919-27 (1992)  
Target
Name:
Oxytocin receptor
Synonyms:
OT-R Otr Oxytocin
Type:
Enzyme Catalytic Domain
Mol. Mass.:
42889.28
Organism:
RAT
Description:
Oxytocin OXTR RAT::P70536
Residue:
388
  
Inhibitor
Name:
BDBM50001337
Synonyms:
1-[2,3-dibromospiro[2,3-dihydro-1H-indene-1,4'-(hexahydropyridine)]-1-ylsulfonylmethyl]-7,7-dimethyl-(1S,4R)-bicyclo[2.2.1]heptan-2-one | CHEMBL339698
Type:
Small organic molecule
Emp. Form.:
C23H29Br2NO3S
Mol. Mass.:
559.354
SMILES:
CC1(C)C2CC[C@@]1(CS(=O)(=O)N1CCC3(CC1)C(Br)C(Br)c1ccccc31)C(=O)C2
: