Target
Oxytocin receptor
Ligand
BDBM50001343
Substrate
Meas. Tech.
ChEBML_149059
IC50
560.0±n/a nM
Citation
 Evans, BELeighton, JLRittle, KEGilbert, KFLundell, GFGould, NPHobbs, DWDiPardo, RMVeber, DFPettibone, DJ Orally active, nonpeptide oxytocin antagonists. J Med Chem 35:3919-27 (1992)  
Target
Name:
Oxytocin receptor
Synonyms:
OT-R Otr Oxytocin
Type:
Enzyme Catalytic Domain
Mol. Mass.:
42889.28
Organism:
RAT
Description:
Oxytocin OXTR RAT::P70536
Residue:
388
  
Inhibitor
Name:
BDBM50001343
Synonyms:
1-[5,6-difluorospiro[1H-indene-1,4'-(hexahydropyridine)]-1-ylsulfonylmethyl]-7,7-dimethyl-(1S,2R,4R)-bicyclo[2.2.1]heptan-2-ol | CHEMBL339302
Type:
Small organic molecule
Emp. Form.:
C23H30FNO3S
Mol. Mass.:
419.553
SMILES:
CC1(C)C2CC[C@@]1(CS(=O)(=O)N1CCC3(CC1)C=Cc1ccc(F)cc31)[C@H](O)C2
: