Target
Adenosine receptor A1
Ligand
BDBM82009
Substrate
Meas. Tech.
ChEBML_29284
Ki
>200000±n/a nM
Citation
 Sakai, RKonno, KYamamoto, YSanae, FTakagi, KHasegawa, TIwasaki, NKakiuchi, MKato, HMiyamoto, K Effects of alkyl substitutions of xanthine skeleton on bronchodilation. J Med Chem 35:4039-44 (1992)  
Target
Name:
Adenosine receptor A1
Synonyms:
A1 adenosine receptor ADENOSINE A1 ADENOSINE A1 low Adenosine A1 receptor | Adenosine Receptor A1
Type:
Enzyme Catalytic Domain
Mol. Mass.:
36501.39
Organism:
GUINEA PIG
Description:
ADENOSINE A1 ADORA1 GUINEA PIG::P47745
Residue:
326
  
Inhibitor
Name:
BDBM82009
Synonyms:
CAS_1188 NSC_1188 | Xanthine
Type:
Small organic molecule
Emp. Form.:
C5H4N4O2
Mol. Mass.:
152.1109
SMILES:
O=c1[nH]c2nc[nH]c2c(=O)[nH]1
: