Target
Adenosine receptor A2a
Ligand
BDBM82020
Substrate
Meas. Tech.
ChEBML_71194
EC50
75900.0±n/a nM
Citation
 Sakai, RKonno, KYamamoto, YSanae, FTakagi, KHasegawa, TIwasaki, NKakiuchi, MKato, HMiyamoto, K Effects of alkyl substitutions of xanthine skeleton on bronchodilation. J Med Chem 35:4039-44 (1992)  
Target
Name:
Adenosine receptor A2a
Synonyms:
A2A adenosine receptor (hA2A) ADENOSINE A2 ADORA2 Adenosine A2A receptor (A2AAR)
Type:
G Protein-Coupled Receptor (GPCR)
Mol. Mass.:
44716.46
Organism:
Homo sapiens (Human)
Description:
P29274
Residue:
412
  
Inhibitor
Name:
BDBM82020
Synonyms:
1-Methyl-3,9-dihydro-purine-2,6-dione(1-methyl xanthine) CAS_80220 NSC_80220
Type:
Small organic molecule
Emp. Form.:
C6H6N4O2
Mol. Mass.:
166.1374
SMILES:
Cn1c(=O)[nH]c2nc[nH]c2c1=O
: