Target
Adenosine receptor A1
Ligand
BDBM50001499
Substrate
Meas. Tech.
ChEBML_29284
Ki
9400±n/a nM
Citation
 Sakai, RKonno, KYamamoto, YSanae, FTakagi, KHasegawa, TIwasaki, NKakiuchi, MKato, HMiyamoto, K Effects of alkyl substitutions of xanthine skeleton on bronchodilation. J Med Chem 35:4039-44 (1992)  
Target
Name:
Adenosine receptor A1
Synonyms:
A1 adenosine receptor ADENOSINE A1 ADENOSINE A1 low Adenosine A1 receptor | Adenosine Receptor A1
Type:
Enzyme Catalytic Domain
Mol. Mass.:
36501.39
Organism:
GUINEA PIG
Description:
ADENOSINE A1 ADORA1 GUINEA PIG::P47745
Residue:
326
  
Inhibitor
Name:
BDBM50001499
Synonyms:
1-Methyl-3,7-dipropyl-3,7-dihydro-purine-2,6-dione | CHEMBL282310
Type:
Small organic molecule
Emp. Form.:
C12H18N4O2
Mol. Mass.:
250.2969
SMILES:
CCCn1cnc2n(CCC)c(=O)n(C)c(=O)c12
: