Target
Vasopressin V1a receptor
Ligand
BDBM50205990
Substrate
Meas. Tech.
ChEMBL_1668475 (CHEMBL4018363)
EC50
5.80±n/a nM
Citation
 Adachi, YSakimura, KShimizu, YNakayama, MTerao, YYano, TAsami, T Potent and selective oxytocin receptor agonists without disulfide bridges. Bioorg Med Chem Lett 27:2331-2335 (2017)  
Target
Name:
Vasopressin V1a receptor
Synonyms:
AVPR V1a AVPR1A V1AR_HUMAN VASOPRESSIN V1A Vasopressin V1 receptor Vasopressin receptor
Type:
Receptor
Mol. Mass.:
46820.18
Organism:
Homo sapiens (Human)
Description:
P37288
Residue:
418
  
Inhibitor
Name:
BDBM50205990
Synonyms:
CHEMBL395429 | OXYTOCIN
Type:
Small organic molecule
Emp. Form.:
C43H66N12O12S2
Mol. Mass.:
1007.187
SMILES:
CC[C@H](C)[C@@H]1NC(=O)[C@H](Cc2ccc(O)cc2)NC(=O)[C@@H](N)CSSC[C@H](NC(=O)[C@H](CC(N)=O)NC(=O)[C@H](CCC(N)=O)NC1=O)C(=O)N1CCC[C@H]1C(=O)N[C@@H](CC(C)C)C(=O)NCC(N)=O
: