Target
Adenosine receptor A3
Ligand
BDBM50252757
Substrate
Meas. Tech.
ChEBML_1669043
Ki
1.5±n/a nM
Citation
 Yu, JAhn, SKim, HJLee, MAhn, SKim, JJin, SHLee, EKim, GCheong, JHJacobson, KAJeong, LSNoh, M Polypharmacology of N J Med Chem 60:7459-7475 (2017)  
Target
Name:
Adenosine receptor A3
Synonyms:
A3 adenosine receptor (hA3) ADORA3 | Adenosine A3 receptor (A3AR)
Type:
G Protein-Coupled Receptor (GPCR)
Mol. Mass.:
36197.32
Organism:
Homo sapiens (Human)
Description:
P0DMS8
Residue:
318
  
Inhibitor
Name:
BDBM50252757
Synonyms:
(2R,3R,4S)-2-(6-(3-Iodobenzylamino)-9H-purin-9-yl)-tetrahydrothiophene-3,4-diol | CHEMBL500569
Type:
Small organic molecule
Emp. Form.:
C16H16IN5O2S
Mol. Mass.:
469.3
SMILES:
O[C@@H]1CS[C@H]([C@@H]1O)n1cnc2c(NCc3cccc(I)c3)ncnc12
: