Target
D(2) dopamine receptor
Ligand
BDBM50001791
Substrate
Meas. Tech.
ChEBML_58717
IC50
82±n/a nM
Citation
 Perregaard, JAndersen, KHyttel, JSánchez, C Selective, centrally acting serotonin 5-HT2 antagonists. 1. 2- and 6-substituted 1-phenyl-3-(4-piperidinyl)-1H-indoles. J Med Chem 35:4813-22 (1993)  
Target
Name:
D(2) dopamine receptor
Synonyms:
DOPAMINE D2 DOPAMINE D2 Short Dopamine D2 receptor Drd2
Type:
G Protein-Coupled Receptor (GPCR)
Mol. Mass.:
50931.60
Organism:
Rattus norvegicus (rat)
Description:
P61169
Residue:
444
  
Inhibitor
Name:
BDBM50001791
Synonyms:
1-(2-{4-[6-Chloro-1-(4-fluoro-phenyl)-1H-indol-3-yl]-piperidin-1-yl}-ethyl)-1,3-dimethyl-urea | CHEMBL144457
Type:
Small organic molecule
Emp. Form.:
C24H28ClFN4O
Mol. Mass.:
442.957
SMILES:
CNC(=O)N(C)CCN1CCC(CC1)c1cn(-c2ccc(F)cc2)c2cc(Cl)ccc12
: