Target
D(2) dopamine receptor
Ligand
BDBM50001789
Substrate
Meas. Tech.
ChEBML_58717
IC50
28±n/a nM
Citation
 Perregaard, JAndersen, KHyttel, JSánchez, C Selective, centrally acting serotonin 5-HT2 antagonists. 1. 2- and 6-substituted 1-phenyl-3-(4-piperidinyl)-1H-indoles. J Med Chem 35:4813-22 (1993)  
Target
Name:
D(2) dopamine receptor
Synonyms:
DOPAMINE D2 DOPAMINE D2 Short Dopamine D2 receptor Drd2
Type:
G Protein-Coupled Receptor (GPCR)
Mol. Mass.:
50931.60
Organism:
Rattus norvegicus (rat)
Description:
P61169
Residue:
444
  
Inhibitor
Name:
BDBM50001789
Synonyms:
1-(2-{4-[6-Fluoro-1-(4-fluoro-phenyl)-1H-indol-3-yl]-piperidin-1-yl}-ethyl)-3-isopropyl-imidazolidin-2-one | CHEMBL359046
Type:
Small organic molecule
Emp. Form.:
C27H32F2N4O
Mol. Mass.:
466.566
SMILES:
CC(C)N1CCN(CCN2CCC(CC2)c2cn(-c3ccc(F)cc3)c3cc(F)ccc23)C1=O
: