Target
Serotonin 2 (5-HT2) receptor
Ligand
BDBM50001795
Substrate
Meas. Tech.
ChEMBL_1907 (CHEMBL884529)
IC50
3.7±n/a nM
Citation
 Perregaard, JAndersen, KHyttel, JSánchez, C Selective, centrally acting serotonin 5-HT2 antagonists. 1. 2- and 6-substituted 1-phenyl-3-(4-piperidinyl)-1H-indoles. J Med Chem 35:4813-22 (1993)  
Target
Name:
Serotonin 2 (5-HT2) receptor
Synonyms:
5-hydroxytryptamine receptor 2A/2B/2C
Type:
Mol. Mass.:
Description:
ASSAY_ID of ChEMBL is 2197419
Components:
This complex has 3 components.
Component 1
Name:
5-hydroxytryptamine receptor 2B
Synonyms:
5-HT2B 5HT2B_RAT Serotonin 2b (5-HT2b) receptor Srl
Type:
Enzyme Catalytic Domain
Mol. Mass.:
53668.47
Organism:
RAT
Description:
5-HT2B HTR2B RAT::P30994
Residue:
479
  
Component 2
Name:
5-hydroxytryptamine receptor 2C
Synonyms:
5-HT2C 5-hydroxytryptamine receptor 2C (5HT2c) 5ht1c Htr2c Serotonin receptor 2a and 2c (5HT2A and 5HT2C)
Type:
Enzyme
Mol. Mass.:
51935.10
Organism:
Rattus norvegicus (Rat)
Description:
P08909
Residue:
460
  
Component 3
Name:
5-hydroxytryptamine receptor 2A
Synonyms:
5-HT-2A 5-HT2A 5-hydroxytryptamine receptor 2A (5HT2A) Htr2 Serotonin Receptor 2A
Type:
G Protein-Coupled Receptor (GPCR)
Mol. Mass.:
52852.05
Organism:
Rattus norvegicus (rat)
Description:
Rat cortex membranes 5-HT2A receptors.
Residue:
471
  
Inhibitor
Name:
BDBM50001795
Synonyms:
1-(2-{4-[6-Chloro-1-(2-fluoro-phenyl)-1H-indol-3-yl]-piperidin-1-yl}-ethyl)-3-isopropyl-imidazolidin-2-one | CHEMBL145706
Type:
Small organic molecule
Emp. Form.:
C27H32ClFN4O
Mol. Mass.:
483.021
SMILES:
CC(C)N1CCN(CCN2CCC(CC2)c2cn(-c3ccccc3F)c3cc(Cl)ccc23)C1=O
: