Target
Alpha-1A adrenergic receptor
Ligand
BDBM50001800
Substrate
Meas. Tech.
ChEBML_33271
IC50
2300±n/a nM
Citation
 Andersen, KPerregaard, JArnt, JNielsen, JBBegtrup, M Selective, centrally acting serotonin 5-HT2 antagonists. 2. Substituted 3-(4-fluorophenyl)-1H-indoles. J Med Chem 35:4823-31 (1993)  
Target
Name:
Alpha-1A adrenergic receptor
Synonyms:
ADA1A_RAT Adra1c Alpha-1A adrenoceptor Alpha-1C adrenergic receptor | adrenergic Alpha1A
Type:
Protein
Mol. Mass.:
51620.15
Organism:
Rattus norvegicus (Rat)
Description:
P43140
Residue:
466
  
Inhibitor
Name:
BDBM50001800
Synonyms:
1-(2-{4-[3-(4-Fluoro-phenyl)-2,5-dimethyl-indol-1-yl]-piperidin-1-yl}-ethyl)-imidazolidin-2-one | CHEMBL343444
Type:
Small organic molecule
Emp. Form.:
C26H31FN4O
Mol. Mass.:
434.5489
SMILES:
Cc1c(-c2ccc(F)cc2)c2cc(C)ccc2n1C1CCN(CCN2CCNC2=O)CC1
: