Target
D(2) dopamine receptor
Ligand
BDBM50001810
Substrate
Meas. Tech.
ChEBML_61406
IC50
3900±n/a nM
Citation
 Andersen, KPerregaard, JArnt, JNielsen, JBBegtrup, M Selective, centrally acting serotonin 5-HT2 antagonists. 2. Substituted 3-(4-fluorophenyl)-1H-indoles. J Med Chem 35:4823-31 (1993)  
Target
Name:
D(2) dopamine receptor
Synonyms:
DOPAMINE D2 DOPAMINE D2 Short Dopamine D2 receptor Drd2
Type:
G Protein-Coupled Receptor (GPCR)
Mol. Mass.:
50931.60
Organism:
Rattus norvegicus (rat)
Description:
P61169
Residue:
444
  
Inhibitor
Name:
BDBM50001810
Synonyms:
3-(4-Fluoro-phenyl)-5-methyl-1-(4-methyl-piperazin-1-yl)-1H-indole | CHEMBL141721
Type:
Small organic molecule
Emp. Form.:
C20H22FN3
Mol. Mass.:
323.4072
SMILES:
CN1CCN(CC1)n1cc(-c2ccc(F)cc2)c2cc(C)ccc12
: