Target
Histone deacetylase 1
Ligand
BDBM50241457
Substrate
Meas. Tech.
ChEMBL_1669855 (CHEMBL4019743)
IC50
350±n/a nM
Citation
 Dong, GChen, WWang, XYang, XXu, TWang, PZhang, WRao, YMiao, CSheng, C Small Molecule Inhibitors Simultaneously Targeting Cancer Metabolism and Epigenetics: Discovery of Novel Nicotinamide Phosphoribosyltransferase (NAMPT) and Histone Deacetylase (HDAC) Dual Inhibitors. J Med Chem 60:7965-7983 (2017)  
Target
Name:
Histone deacetylase 1
Synonyms:
Cereblon/Histone deacetylase 1 HDAC1 Histone deacetylase 1 (HDAC1) RPD3L1
Type:
Enzyme
Mol. Mass.:
55090.27
Organism:
Homo sapiens (Human)
Description:
Q13547
Residue:
482
  
Inhibitor
Name:
BDBM50241457
Synonyms:
CHEMBL4096345
Type:
Small organic molecule
Emp. Form.:
C20H18BrN5OS
Mol. Mass.:
456.359
SMILES:
Nc1ccccc1NC(=O)c1ccc(NC(=S)NCc2cncc(Br)c2)cc1
: