Target
Rap guanine nucleotide exchange factor 4
Ligand
BDBM50241954
Substrate
Meas. Tech.
ChEMBL_1670999 (CHEMBL4021028)
IC50
2300±n/a nM
Citation
 Ye, NZhu, YLiu, ZMei, FCChen, HWang, PCheng, XZhou, J Identification of novel 2-(benzo[d]isoxazol-3-yl)-2-oxo-N-phenylacetohydrazonoyl cyanide analoguesas potent EPAC antagonists. Eur J Med Chem 134:62-71 (2017)  
Target
Name:
Rap guanine nucleotide exchange factor 4
Synonyms:
Cgef2 EPAC 2 Exchange factor directly activated by cAMP 2 RPGF4_MOUSE Rapgef4 cAMP-dependent Rap1 guanine-nucleotide exchange factor | cAMP-regulated guanine nucleotide exchange factor II
Type:
PROTEIN
Mol. Mass.:
115497.71
Organism:
Mus musculus
Description:
ChEMBL_109832
Residue:
1011
  
Inhibitor
Name:
BDBM50241954
Synonyms:
CHEMBL4082655
Type:
Small organic molecule
Emp. Form.:
C17H8ClF3N4O3
Mol. Mass.:
408.719
SMILES:
FC(F)(F)c1cc(N\N=C(/C#N)C(=O)c2cc(on2)-c2ccco2)ccc1Cl
: