Target
Rap guanine nucleotide exchange factor 3
Ligand
BDBM50241953
Substrate
Meas. Tech.
ChEMBL_1670998 (CHEMBL4021027)
IC50
4600±n/a nM
Citation
 Ye, NZhu, YLiu, ZMei, FCChen, HWang, PCheng, XZhou, J Identification of novel 2-(benzo[d]isoxazol-3-yl)-2-oxo-N-phenylacetohydrazonoyl cyanide analoguesas potent EPAC antagonists. Eur J Med Chem 134:62-71 (2017)  
Target
Name:
Rap guanine nucleotide exchange factor 3
Synonyms:
CGEF1 EPAC 1 Exchange factor directly activated by cAMP 1 RAPGEF3 Rap1 guanine-nucleotide-exchange factor directly activated by cAMP cAMP-regulated guanine nucleotide exchange factor I
Type:
PROTEIN
Mol. Mass.:
103769.52
Organism:
Homo sapiens (Human)
Description:
ChEMBL_104531
Residue:
923
  
Inhibitor
Name:
BDBM50241953
Synonyms:
CHEMBL4091792
Type:
Small organic molecule
Emp. Form.:
C17H8ClF3N4O2
Mol. Mass.:
392.719
SMILES:
FC(F)(F)c1cc(Cl)cc(N\N=C(/C#N)C(=O)c2noc3ccccc23)c1
: