Target
Rap guanine nucleotide exchange factor 3
Ligand
BDBM50241967
Substrate
Meas. Tech.
ChEMBL_1670998 (CHEMBL4021027)
IC50
7300±n/a nM
Citation
 Ye, NZhu, YLiu, ZMei, FCChen, HWang, PCheng, XZhou, J Identification of novel 2-(benzo[d]isoxazol-3-yl)-2-oxo-N-phenylacetohydrazonoyl cyanide analoguesas potent EPAC antagonists. Eur J Med Chem 134:62-71 (2017)  
Target
Name:
Rap guanine nucleotide exchange factor 3
Synonyms:
CGEF1 EPAC 1 Exchange factor directly activated by cAMP 1 RAPGEF3 Rap1 guanine-nucleotide-exchange factor directly activated by cAMP cAMP-regulated guanine nucleotide exchange factor I
Type:
PROTEIN
Mol. Mass.:
103769.52
Organism:
Homo sapiens (Human)
Description:
ChEMBL_104531
Residue:
923
  
Inhibitor
Name:
BDBM50241967
Synonyms:
CHEMBL4087626
Type:
Small organic molecule
Emp. Form.:
C23H18ClF3N4O2
Mol. Mass.:
474.863
SMILES:
CC(C)(C)c1ccc(cc1)-c1cc(no1)C(=O)C(=N\Nc1ccc(Cl)c(c1)C(F)(F)F)\C#N
: