Target
Prostacyclin receptor
Ligand
BDBM50002403
Substrate
Meas. Tech.
ChEBML_158010
IC50
>10000±n/a nM
Citation
 Meanwell, NARosenfeld, MJWright, JJBrassard, CLBuchanan, JOFederici, MEFleming, JSSeiler, SM Structure-activity relationships associated with 3,4,5-triphenyl-1H-pyrazole-1-nonanoic acid, a nonprostanoid prostacyclin mimetic. J Med Chem 35:389-97 (1992)  
Target
Name:
Prostacyclin receptor
Synonyms:
PGI receptor PRIPR Prostacyclin (IP) Receptor Prostaglandin I Prostaglandin I2 receptor | Prostanoid IP receptor
Type:
G Protein-Coupled Receptor (GPCR)
Mol. Mass.:
40968.22
Organism:
Homo sapiens (Human)
Description:
The membranes prepared from human platelet were used in binding assay.
Residue:
386
  
Inhibitor
Name:
BDBM50002403
Synonyms:
9-(3,5-Diphenyl-pyrazol-1-yl)-nonanoic acid | CHEMBL129568
Type:
Small organic molecule
Emp. Form.:
C24H28N2O2
Mol. Mass.:
376.4913
SMILES:
OC(=O)CCCCCCCCn1nc(cc1-c1ccccc1)-c1ccccc1
: