Target
Substance-P receptor
Ligand
BDBM50002459
Substrate
Meas. Tech.
ChEBML_208650
IC50
360±n/a nM
Citation
 Lawrence, KBVenepalli, BRAppell, KCGoswami, RLogan, METomczuk, BEYanni, JM Synthesis and substance P antagonist activity of naphthimidazolium derivatives. J Med Chem 35:1273-9 (1992)  
Target
Name:
Substance-P receptor
Synonyms:
NK-1 receptor NK1 Receptor Neurokinin 1 receptor SPR Tac1r Tacr1
Type:
G Protein-Coupled Receptor (GPCR)
Mol. Mass.:
46371.54
Organism:
Rattus norvegicus (rat)
Description:
Competition binding assays were carried out using membrane preparations from transfected CHO cells that constitutively expressed the rat NK1 receptor.
Residue:
407
  
Inhibitor
Name:
BDBM50002459
Synonyms:
1,3-Diethyl-2-[3-(1-ethyl-3,3-dimethyl-1,3-dihydro-indol-2-ylidene)-propenyl]-3H-naphtho[2,3-d]imidazol-1-ium; chloride | CHEMBL23147
Type:
Small organic molecule
Emp. Form.:
C30H34N3
Mol. Mass.:
436.6105
SMILES:
CCN1\C(=C/C=C/c2n(CC)c3cc4ccccc4cc3[n+]2CC)C(C)(C)c2ccccc12
: