Target
Thromboxane A2 receptor
Ligand
BDBM50002758
Substrate
Meas. Tech.
ChEMBL_209575 (CHEMBL879433)
Ki
6.8±n/a nM
Citation
 Ohshima, ETakami, HSato, HObase, HMiki, IIshii, AKarasawa, AKubo, K Non-prostanoid thromboxane A2 receptor antagonists with a dibenzoxepin ring system. 1. J Med Chem 35:3394-402 (1992)  
Target
Name:
Thromboxane A2 receptor
Synonyms:
Prostanoid TP receptor TBXA2R Thromboxane Thromboxane Beta
Type:
Enyzme
Mol. Mass.:
37445.28
Organism:
Homo sapiens (Human)
Description:
P21731
Residue:
343
  
Inhibitor
Name:
BDBM50002758
Synonyms:
11-(2-Benzenesulfonylamino-ethylsulfanyl)-9-bromo-6,11-dihydro-dibenzo[b,e]oxepine-2-carboxylic acid | CHEMBL114102
Type:
Small organic molecule
Emp. Form.:
C23H20BrNO5S2
Mol. Mass.:
534.443
SMILES:
OC(=O)c1ccc2OCc3ccc(Br)cc3C(SCCNS(=O)(=O)c3ccccc3)c2c1
: