Target
Renin
Ligand
BDBM50002994
Substrate
Meas. Tech.
ChEBML_195788
pH
5.5±n/a
IC50
46±n/a nM
Comments
extracted
Citation
 Raddatz, PJonczyk, AMinck, KORippmann, FSchittenhelm, CSchmitges, CJ Renin inhibitors containing new P1-P1' dipeptide mimetics with heterocycles in P1'. J Med Chem 35:3525-36 (1992)  
Target
Name:
Renin
Synonyms:
Angiotensinogenase RENI_HUMAN
Type:
Enzyme
Mol. Mass.:
45058.99
Organism:
Homo sapiens (Human)
Description:
Residue:
406
  
Inhibitor
Name:
BDBM50002994
Synonyms:
2-Benzyl-N-[1-[1-cyclohexylmethyl-2-hydroxy-4-(pyridin-2-ylsulfanyl)-butylcarbamoyl]-2-(1H-imidazol-4-yl)-ethyl]-3-(2-methyl-propane-2-sulfonyl)-propionamide | CHEMBL333706
Type:
Small organic molecule
Emp. Form.:
C36H51N5O5S2
Mol. Mass.:
697.951
SMILES:
CC(C)(C)S(=O)(=O)C[C@@H](Cc1ccccc1)C(=O)N[C@@H](Cc1cnc[nH]1)C(=O)N[C@@H](CC1CCCCC1)[C@@H](O)CCSc1ccccn1
: