Target
Bifunctional purine biosynthesis protein ATIC
Ligand
BDBM50003058
Substrate
Meas. Tech.
ChEBML_28407
IC50
17000±n/a nM
Citation
 Gangjee, APatel, JKisliuk, RLGaumont, Y 5,10-Methylenetetrahydro-5-deazafolic acid and analogues: synthesis and biological activities. J Med Chem 35:3678-85 (1992)  
Target
Name:
Bifunctional purine biosynthesis protein ATIC
Synonyms:
5-aminoimidazole-4-carboxamide ribonucleotide formyltransferase AICAR Tfase ATIC Bifunctional purine biosynthesis protein PURH IMP cyclohydrolase Inosinicase PURH Thymidylate synthase/GAR transformylase/AICAR transformylase
Type:
Protein
Mol. Mass.:
64616.62
Organism:
Homo sapiens (Human)
Description:
P31939
Residue:
592
  
Inhibitor
Name:
BDBM50003058
Synonyms:
2-[4-(7-Amino-9-oxo-8,9-dihydro-2,5,6,8-tetraaza-cyclopenta[a]naphthalen-2-yl)-benzoylamino]-pentanedioic acid | CHEMBL331208
Type:
Small organic molecule
Emp. Form.:
C21H18N6O6
Mol. Mass.:
450.4042
SMILES:
Nc1nc(O)c2c3cn(cc3cnc2n1)-c1ccc(cc1)C(=O)NC(CCC(O)=O)C(O)=O
: