Target
Type-1 angiotensin II receptor B
Ligand
BDBM50003154
Substrate
Meas. Tech.
ChEBML_34834
Ki
0.760000±n/a nM
Citation
 De, BWinn, MZydowsky, TMKerkman, DJDeBernardis, JFLee, JBuckner, SWarner, RBrune, MHancock, A Discovery of a novel class of orally active, non-peptide angiotensin II antagonists. J Med Chem 35:3714-7 (1992)  
Target
Name:
Type-1 angiotensin II receptor B
Synonyms:
AGTRB_RAT Agtr1 Angiotensin II AT1B Angiotensin II type 1b (AT-1b) receptor Type-1B angiotensin II receptor
Type:
Enzyme Catalytic Domain
Mol. Mass.:
40929.44
Organism:
RAT
Description:
Angiotensin II AT1B 0 RAT::P29089
Residue:
359
  
Inhibitor
Name:
BDBM50003154
Synonyms:
2-{Propyl-[2'-(1H-tetrazol-5-yl)-biphenyl-4-ylmethyl]-amino}-nicotinic acid A-81988 | CHEMBL416477
Type:
Small organic molecule
Emp. Form.:
C23H22N6O2
Mol. Mass.:
414.4598
SMILES:
CCCN(Cc1ccc(cc1)-c1ccccc1-c1nnn[nH]1)c1ncccc1C(O)=O
: