Target
Type-1 angiotensin II receptor B
Ligand
BDBM50003269
Substrate
Meas. Tech.
ChEBML_34812
IC50
2400±n/a nM
Citation
 Keenan, RMWeinstock, JFinkelstein, JAFranz, RGGaitanopoulos, DEGirard, GRHill, DTMorgan, TMSamanen, JMHempel, J Imidazole-5-acrylic acids: potent nonpeptide angiotensin II receptor antagonists designed using a novel peptide pharmacophore model. J Med Chem 35:3858-72 (1992)  
Target
Name:
Type-1 angiotensin II receptor B
Synonyms:
AGTRB_RAT Agtr1 Angiotensin II AT1B Angiotensin II type 1b (AT-1b) receptor Type-1B angiotensin II receptor
Type:
Enzyme Catalytic Domain
Mol. Mass.:
40929.44
Organism:
RAT
Description:
Angiotensin II AT1B 0 RAT::P29089
Residue:
359
  
Inhibitor
Name:
BDBM50003269
Synonyms:
3-[2-Butyl-3-(2-chloro-benzyl)-3H-imidazol-4-yl]-2-(phenyl-thiophen-2-yl-methyl)-acrylic acid | CHEMBL337928
Type:
Small organic molecule
Emp. Form.:
C28H27ClN2O2S
Mol. Mass.:
491.044
SMILES:
CCCCc1ncc(\C=C(/C(c2cccs2)c2ccccc2)C(O)=O)n1Cc1ccccc1Cl
: