Target
Muscarinic acetylcholine receptor M1
Ligand
BDBM50003363
Substrate
Meas. Tech.
ChEMBL_138803 (CHEMBL751538)
IC50
2.4±n/a nM
Citation
 Ward, JSMerritt, LKlimkowski, VJLamb, MLMitch, CHBymaster, FPSawyer, BShannon, HEOlesen, PHHonoré, T Novel functional M1 selective muscarinic agonists. 2. Synthesis and structure-activity relationships of 3-pyrazinyl-1,2,5,6-tetrahydro-1-methylpyridines. Construction of a molecular model for the M1 pharmacophore. J Med Chem 35:4011-9 (1992)  
Target
Name:
Muscarinic acetylcholine receptor M1
Synonyms:
ACM1_RAT Chrm-1 cholinergic receptor, muscarinic 1
Type:
Enzyme Catalytic Domain
Mol. Mass.:
51390.46
Organism:
RAT
Description:
P08482
Residue:
460
  
Inhibitor
Name:
BDBM50003363
Synonyms:
1-Methyl-5-(4-pentylsulfanyl-[1,2,5]thiadiazol-3-yl)-1,2,3,6-tetrahydro-pyridine CHEMBL130715 | CHEMBL308381
Type:
Small organic molecule
Emp. Form.:
C13H21N3S2
Mol. Mass.:
283.456
SMILES:
CCCCCSc1nsnc1C1=CCCN(C)C1
: