Target
Type-1 angiotensin II receptor
Ligand
BDBM50003387
Substrate
Meas. Tech.
ChEBML_36783
IC50
31±n/a nM
Citation
 Bradbury, RHAllott, CPDennis, MFisher, EMajor, JSMasek, BBOldham, AAPearce, RJRankine, NRevill, JM New nonpeptide angiotensin II receptor antagonists. 2. Synthesis, biological properties, and structure-activity relationships of 2-alkyl-4-(biphenylylmethoxy)quinoline derivatives. J Med Chem 35:4027-38 (1992)  
Target
Name:
Type-1 angiotensin II receptor
Synonyms:
AGTR1 AT1 | Angiotensin II type-1 receptor
Type:
PROTEIN
Mol. Mass.:
41004.19
Organism:
Cavia porcellus
Description:
ChEMBL_36783
Residue:
359
  
Inhibitor
Name:
BDBM50003387
Synonyms:
2-Ethyl-4-[2'-(1H-tetrazol-5-yl)-biphenyl-4-ylmethoxy]-quinoline CHEMBL284536 | ZD-8731
Type:
Small organic molecule
Emp. Form.:
C25H21N5O
Mol. Mass.:
407.4671
SMILES:
CCc1cc(OCc2ccc(cc2)-c2ccccc2-c2nnn[nH]2)c2ccccc2n1
: