Target
Polyunsaturated fatty acid 5-lipoxygenase
Ligand
BDBM50003415
Substrate
Meas. Tech.
ChEBML_3958
IC50
1900±n/a nM
Citation
 Wright, SWHarris, RRKerr, JSGreen, AMPinto, DJBruin, EMCollins, RJDorow, RLMantegna, LRSherk, SR Synthesis, chemical, and biological properties of vinylogous hydroxamic acids: dual inhibitors of 5-lipoxygenase and IL-1 biosynthesis. J Med Chem 35:4061-8 (1992)  
Target
Name:
Polyunsaturated fatty acid 5-lipoxygenase
Synonyms:
Alox5 LOX5_RAT
Type:
PROTEIN
Mol. Mass.:
78082.31
Organism:
Rattus norvegicus
Description:
ChEMBL_1432947
Residue:
673
  
Inhibitor
Name:
BDBM50003415
Synonyms:
CHEMBL130267 | Sodium salt of 1-(4-Benzoyl-phenyl)-3-(hydroxy-methyl-amino)-propenone
Type:
Small organic molecule
Emp. Form.:
C17H16NO3
Mol. Mass.:
282.3144
SMILES:
CN([O-])\C=C/C(=O)c1ccc(OCc2ccccc2)cc1
: