Target
Polyunsaturated fatty acid 5-lipoxygenase
Ligand
BDBM50003441
Substrate
Meas. Tech.
ChEBML_3958
IC50
>25000±n/a nM
Citation
 Wright, SWHarris, RRKerr, JSGreen, AMPinto, DJBruin, EMCollins, RJDorow, RLMantegna, LRSherk, SR Synthesis, chemical, and biological properties of vinylogous hydroxamic acids: dual inhibitors of 5-lipoxygenase and IL-1 biosynthesis. J Med Chem 35:4061-8 (1992)  
Target
Name:
Polyunsaturated fatty acid 5-lipoxygenase
Synonyms:
Alox5 LOX5_RAT
Type:
PROTEIN
Mol. Mass.:
78082.31
Organism:
Rattus norvegicus
Description:
ChEMBL_1432947
Residue:
673
  
Inhibitor
Name:
BDBM50003441
Synonyms:
3-(Benzyl-methoxy-amino)-1-(2-methoxy-phenyl)-propenone | CHEMBL130052
Type:
Small organic molecule
Emp. Form.:
C18H19NO3
Mol. Mass.:
297.3484
SMILES:
CON(Cc1ccccc1)\C=C/C(=O)c1ccccc1OC
: