Target
Polyunsaturated fatty acid 5-lipoxygenase
Ligand
BDBM50003443
Substrate
Meas. Tech.
ChEBML_3958
IC50
>25000±n/a nM
Citation
 Wright, SWHarris, RRKerr, JSGreen, AMPinto, DJBruin, EMCollins, RJDorow, RLMantegna, LRSherk, SR Synthesis, chemical, and biological properties of vinylogous hydroxamic acids: dual inhibitors of 5-lipoxygenase and IL-1 biosynthesis. J Med Chem 35:4061-8 (1992)  
Target
Name:
Polyunsaturated fatty acid 5-lipoxygenase
Synonyms:
Alox5 LOX5_RAT
Type:
PROTEIN
Mol. Mass.:
78082.31
Organism:
Rattus norvegicus
Description:
ChEMBL_1432947
Residue:
673
  
Inhibitor
Name:
BDBM50003443
Synonyms:
1-(4-Benzoyl-phenyl)-3-methyl-3-acetyloxyamino-propenone | CHEMBL334790
Type:
Small organic molecule
Emp. Form.:
C19H19NO4
Mol. Mass.:
325.3585
SMILES:
CN(OC(C)=O)C=CC(=O)c1ccc(OCc2ccccc2)cc1
: