Target
Folylpolyglutamate synthase, mitochondrial
Ligand
BDBM50003467
Substrate
Meas. Tech.
ChEBML_68691
Ki
8.8±n/a nM
Citation
 Hynes, JBSingh, SKFetzer, OShane, B Inhibition of hog liver folylpolyglutamate synthetase by 5-substituted 5,8-dideaza analogues of folic acid bearing a terminal L-ornithine residue. J Med Chem 35:4078-85 (1992)  
Target
Name:
Folylpolyglutamate synthase, mitochondrial
Synonyms:
FOLC_HUMAN Folylpoly-gamma-glutamate synthetase Tetrahydrofolate synthase | Tetrahydrofolylpolyglutamate synthase
Type:
PROTEIN
Mol. Mass.:
64621.95
Organism:
Homo sapiens (Human)
Description:
ChEMBL_68676
Residue:
587
  
Inhibitor
Name:
BDBM50003467
Synonyms:
5-Amino-2-{4-[(2-amino-4-oxo-5-trifluoromethyl-3,4-dihydro-quinazolin-6-ylmethyl)-amino]-benzoylamino}-pentanoic acid | CHEMBL130518
Type:
Small organic molecule
Emp. Form.:
C22H23F3N6O4
Mol. Mass.:
492.451
SMILES:
NCCCC(NC(=O)c1ccc(NCc2ccc3nc(N)[nH]c(=O)c3c2C(F)(F)F)cc1)C(O)=O
: