Target
5-hydroxytryptamine receptor 1D
Ligand
BDBM30707
Substrate
Meas. Tech.
ChEBML_1658
IC50
49±n/a nM
Citation
 Macor, JEBlake, JFox, CBJohnson, CKoe, BKLebel, LAMorrone, JMRyan, KSchmidt, AWSchulz, DW Synthesis and serotonergic pharmacology of the enantiomers of 3-[(N-methylpyrrolidin-2-yl)methyl]-5-methoxy-1H-indole: discovery of stereogenic differentiation in the aminoethyl side chain of the neurotransmitter serotonin. J Med Chem 35:4503-5 (1992)  
Target
Name:
5-hydroxytryptamine receptor 1D
Synonyms:
5-HT1D 5HT1D_CAVPO Serotonin 1d (5-HT1d) receptor
Type:
Enzyme Catalytic Domain
Mol. Mass.:
41780.38
Organism:
GUINEA PIG
Description:
5-HT1D HTR1D GUINEA PIG::Q60484
Residue:
376
  
Inhibitor
Name:
BDBM30707
Synonyms:
2-(5-methoxy-1H-indol-3-yl)-N,N-dimethyl-ethanamine 2-(5-methoxy-1H-indol-3-yl)ethyl-dimethyl-amine CHEMBL7257 Methoxydimethyltryptamines WO2023019367, Compound 5-MeO-DMT | cid_1832
Type:
Small organic molecule
Emp. Form.:
C13H18N2O
Mol. Mass.:
218.2948
SMILES:
COc1ccc2[nH]cc(CCN(C)C)c2c1
: