Target
Integrin alpha-IIb/beta-3
Ligand
BDBM50004069
Substrate
Meas. Tech.
ChEBML_90196
IC50
35000±n/a nM
Citation
 Hartman, GDEgbertson, MSHalczenko, WLaswell, WLDuggan, MESmith, RLNaylor, AMManno, PDLynch, RJZhang, G Non-peptide fibrinogen receptor antagonists. 1. Discovery and design of exosite inhibitors. J Med Chem 35:4640-2 (1993)  
Target
Name:
Integrin alpha-IIb/beta-3
Synonyms:
Glycoprotein IIb/IIIa
Type:
Mol. Mass.:
Description:
ASSAY_ID of EBI is 30109
Components:
This complex has 2 components.
Component 1
Name:
Integrin beta-3
Synonyms:
CD_antigen=CD61 GPIIIa ITGB3 Platelet membrane glycoprotein IIIa
Type:
Protein
Mol. Mass.:
87038.91
Organism:
Homo sapiens (Human)
Description:
P05106
Residue:
788
  
Component 2
Name:
Integrin alpha-IIb
Synonyms:
CD_antigen=CD41 GPIIb Glycoprotein IIb ITGA2B Integrin alpha-IIb heavy chain Integrin alpha-IIb light chain, form 2 Integrin alpha-V/beta-3 and alpha-IIb/beta 3 | Platelet membrane glycoprotein IIb
Type:
Protein
Mol. Mass.:
113354.85
Organism:
Homo sapiens (Human)
Description:
P08514
Residue:
1039
  
Inhibitor
Name:
BDBM50004069
Synonyms:
(S)-2-Amino-3-[4-(6-amino-hexyloxy)-phenyl]-propionic acid CHEMBL84589
Type:
Small organic molecule
Emp. Form.:
C15H24N2O3
Mol. Mass.:
280.3627
SMILES:
NCCCCCCOc1ccc(C[C@H](N)C(O)=O)cc1
: