Target
Acetylcholinesterase
Ligand
BDBM50004657
Substrate
Meas. Tech.
ChEBML_28294
IC50
120±n/a nM
Citation
 Valli, MJTang, YKosh, JWChapman, JMSowell, JW Synthesis and cholinergic properties of N-aryl-2-[[[5-[(dimethylamino)methyl]-2-furanyl]methyl]thio]ethylamino analogs of ranitidine. J Med Chem 35:3141-7 (1992)  
Target
Name:
Acetylcholinesterase
Synonyms:
ACES_HUMAN Acetylcholinesterase (AChE) | Acetylcholinesterase (human AChE)
Type:
Enzyme
Mol. Mass.:
67792.70
Organism:
Homo sapiens (Human)
Description:
P22303
Residue:
614
  
Inhibitor
Name:
BDBM50004657
Synonyms:
CHEMBL104681 | [2-(5-Dimethylaminomethyl-furan-2-ylmethylsulfanyl)-ethyl]-(5-fluoro-2,4-dinitro-phenyl)-amine
Type:
Small organic molecule
Emp. Form.:
C16H19FN4O5S
Mol. Mass.:
398.409
SMILES:
CN(C)Cc1ccc(CSCCNc2cc(F)c(cc2[N+]([O-])=O)[N+]([O-])=O)o1
: