Target
Muscarinic acetylcholine receptor M1
Ligand
BDBM50004661
Substrate
Meas. Tech.
ChEMBL_138558 (CHEMBL746425)
IC50
1400±n/a nM
Citation
 Valli, MJTang, YKosh, JWChapman, JMSowell, JW Synthesis and cholinergic properties of N-aryl-2-[[[5-[(dimethylamino)methyl]-2-furanyl]methyl]thio]ethylamino analogs of ranitidine. J Med Chem 35:3141-7 (1992)  
Target
Name:
Muscarinic acetylcholine receptor M1
Synonyms:
ACM1_MOUSE Cholinergic, muscarinic Chrm1 Muscarinic acetylcholine receptor M1
Type:
Enzyme Catalytic Domain
Mol. Mass.:
51400.50
Organism:
Mus musculus
Description:
Cholinergic, muscarinic 0 0::Q52KQ0
Residue:
460
  
Inhibitor
Name:
BDBM50004661
Synonyms:
CHEMBL316973 | [2-(5-Dimethylaminomethyl-furan-2-ylmethylsulfanyl)-ethyl]-(2,4-dinitro-phenyl)-amine
Type:
Small organic molecule
Emp. Form.:
C16H20N4O5S
Mol. Mass.:
380.419
SMILES:
CN(C)Cc1ccc(CSCCNc2ccc(cc2[N+]([O-])=O)[N+]([O-])=O)o1
: