Target
Prostaglandin G/H synthase 1/2
Ligand
BDBM50004679
Substrate
Meas. Tech.
ChEMBL_157969 (CHEMBL767499)
IC50
>750000±n/a nM
Citation
 Wright, SWHarris, RRCollins, RJCorbett, RLGreen, AMWadman, EABatt, DG Novel 1-(pyridylphenyl)-1-phenyl-2-imidazolylethanols with topical antiinflammatory activity. J Med Chem 35:3148-55 (1992)  
Target
Name:
Prostaglandin G/H synthase 1/2
Synonyms:
Cyclooxygenase
Type:
Mol. Mass.:
Description:
ASSAY_ID of ChEMBL is 1570295
Components:
This complex has 2 components.
Component 1
Name:
Prostaglandin G/H synthase 2
Synonyms:
COX2 Cyclooxygenase-2 PGH2_BOVIN PHS II Prostaglandin H2 synthase 2 | Prostaglandin-endoperoxide synthase 2
Type:
PROTEIN
Mol. Mass.:
69173.20
Organism:
Bos taurus
Description:
ChEMBL_157990
Residue:
604
  
Component 2
Name:
Prostaglandin G/H synthase 1
Synonyms:
COX-1 Cyclooxygenase PGH1_BOVIN | PTGS1
Type:
PROTEIN
Mol. Mass.:
68814.10
Organism:
Bos taurus
Description:
ChEMBL_547440
Residue:
600
  
Inhibitor
Name:
BDBM50004679
Synonyms:
2-Benzyl-naphthalen-1-ol CHEMBL85000
Type:
Small organic molecule
Emp. Form.:
C17H14O
Mol. Mass.:
234.2925
SMILES:
Oc1c(Cc2ccccc2)ccc2ccccc12
: