Target
Adenosine receptor A1
Ligand
BDBM50004720
Substrate
Meas. Tech.
ChEMBL_28536 (CHEMBL636726)
IC50
4800±n/a nM
Citation
 Peet, NPLentz, NLSunder, SDudley, MWOgden, AM Conformationally restrained, chiral (phenylisopropyl)amino-substituted pyrazolo[3,4-d]pyrimidines and purines with selectivity for adenosine A1 and A2 receptors. J Med Chem 35:3263-9 (1992)  
Target
Name:
Adenosine receptor A1
Synonyms:
AA1R_RAT ADENOSINE A1 high Adenosine A1 receptor (A1) Adenosine receptors A1 | Adora1
Type:
Protein
Mol. Mass.:
36704.13
Organism:
Rattus norvegicus (rat)
Description:
Residue:
326
  
Inhibitor
Name:
BDBM50004720
Synonyms:
6-Methoxy-5-methyl-1-phenyl-1,5-dihydro-pyrazolo[3,4-d]pyrimidin-4-one | CHEMBL334046
Type:
Small organic molecule
Emp. Form.:
C13H12N4O2
Mol. Mass.:
256.26
SMILES:
COc1nc2n(ncc2c(=O)n1C)-c1ccccc1
: