Target
Adenosine receptor A2a/A2b
Ligand
BDBM50004721
Substrate
Meas. Tech.
ChEMBL_30725 (CHEMBL648804)
Ki
1600±n/a nM
Citation
 Peet, NPLentz, NLSunder, SDudley, MWOgden, AM Conformationally restrained, chiral (phenylisopropyl)amino-substituted pyrazolo[3,4-d]pyrimidines and purines with selectivity for adenosine A1 and A2 receptors. J Med Chem 35:3263-9 (1992)  
Target
Name:
Adenosine receptor A2a/A2b
Synonyms:
Adenosine A2 receptor
Type:
Mol. Mass.:
Description:
ASSAY_ID of ChEMBL is 30560
Components:
This complex has 2 components.
Component 1
Name:
Adenosine receptor A2b
Synonyms:
AA2BR_RAT Adora2b
Type:
PROTEIN
Mol. Mass.:
36378.84
Organism:
Rattus norvegicus
Description:
ChEMBL_32934
Residue:
332
  
Component 2
Name:
Adenosine receptor A2a
Synonyms:
AA2AR_RAT Adenosine A2 receptor Adenosine Receptors A2a (A2a) Adenosine receptors A2a Rat striatal adenosine A2a receptor
Type:
G Protein-Coupled Receptor (GPCR)
Mol. Mass.:
45015.65
Organism:
Rattus norvegicus (rat)
Description:
Rat A2A receptors expressed in CHO cells.
Residue:
410
  
Inhibitor
Name:
BDBM50004721
Synonyms:
(S)-8-Benzyl-3-phenyl-5-propoxy-7,8-dihydro-3H-imidazo[2,1-i]purine CHEMBL321240
Type:
Small organic molecule
Emp. Form.:
C23H23N5O
Mol. Mass.:
385.4616
SMILES:
CCCOC1=Nc2c(ncn2-c2ccccc2)C2=N[C@@H](Cc3ccccc3)CN12
: