Target
Muscarinic acetylcholine receptor
Ligand
BDBM50004736
Substrate
Meas. Tech.
ChEMBL_138312 (CHEMBL743823)
Kd
26400±n/a nM
Citation
 Nilsson, BMVargas, HMHacksell, U Urea and 2-imidazolidone derivatives of the muscarinic agents oxotremorine and N-methyl-N-(1-methyl-4-pyrrolidino-2-butynyl)acetamide. J Med Chem 35:3270-9 (1992)  
Target
Name:
Muscarinic acetylcholine receptor
Synonyms:
GPM3 | Muscarinic acetylcholine receptor M3
Type:
Mol. Mass.:
66272.13
Organism:
Cavia porcellus
Description:
Residue:
587
  
Inhibitor
Name:
BDBM50004736
Synonyms:
1,3-Dimethyl-1-(4-pyrrolidin-1-yl-but-2-ynyl)-urea | CHEMBL321674
Type:
Small organic molecule
Emp. Form.:
C11H19N3O
Mol. Mass.:
209.2881
SMILES:
CNC(=O)N(C)CC#CCN1CCCC1
: