Target
D(1A) dopamine receptor
Ligand
BDBM50004920
Substrate
Meas. Tech.
ChEBML_58162
IC50
10700±n/a nM
Citation
 Neumeyer, JLKula, NSBaldessarini, RJBaindur, N Stereoisomeric probes for the D1 dopamine receptor: synthesis and characterization of R-(+) and S-(-) enantiomers of 3-allyl-7,8-dihydroxy-1-phenyl-2,3,4,5-tetrahydro-1H-3-benzazepine and its 6-bromo analogue. J Med Chem 35:1466-71 (1992)  
Target
Name:
D(1A) dopamine receptor
Synonyms:
DOPAMINE D1 Dopamine D1 high Dopamine receptor Dopamine1-like Drd1a
Type:
Enzyme Catalytic Domain
Mol. Mass.:
49429.75
Organism:
RAT
Description:
P18901
Residue:
446
  
Inhibitor
Name:
BDBM50004920
Synonyms:
CHEMBL284746 | S(-)SKF 383931-Phenyl-2,3,4,5-tetrahydro-1H-benzo[d]azepine-7,8-diol
Type:
Small organic molecule
Emp. Form.:
C16H17NO2
Mol. Mass.:
255.3117
SMILES:
Oc1cc2CCNC[C@@H](c3ccccc3)c2cc1O
: